Contenu | Rechercher | Menus

Annonce

Si vous avez des soucis pour rester connecté, déconnectez-vous puis reconnectez-vous depuis ce lien en cochant la case
Me connecter automatiquement lors de mes prochaines visites.

À propos de l'équipe du forum.

#1 Le 31/01/2006, à 20:46

intokabile

configure: error: Cannot find GTK: Is gtk-config in path?

Slt,

J'aimerais installer le driver z_42 pour mon imprimante lexmark x73 et voici le message d'erreur

intokabile@ubuntu:~/Desktop/DownloadedFiles/drv_z42/z42tool$ ./configure
checking for a BSD-compatible install... /usr/bin/install -c
checking whether build environment is sane... yes
checking for gawk... gawk
checking whether make sets $(MAKE)... yes
checking for style of include used by make... GNU
checking for gcc... gcc
checking for C compiler default output... a.out
checking whether the C compiler works... yes
checking whether we are cross compiling... no
checking for suffix of executables...
checking for suffix of object files... o
checking whether we are using the GNU C compiler... yes
checking whether gcc accepts -g... yes
checking for gcc option to accept ANSI C... none needed
checking dependency style of gcc... gcc3
checking for strerror in -lcposix... no
checking for gcc... (cached) gcc
checking whether we are using the GNU C compiler... (cached) yes
checking whether gcc accepts -g... (cached) yes
checking for gcc option to accept ANSI C... (cached) none needed
checking dependency style of gcc... (cached) gcc3
checking for gcc option to accept ANSI C... none needed
checking how to run the C preprocessor... gcc -E
checking for egrep... grep -E
checking for ANSI C header files... yes
checking whether to enable maintainer-specific portions of Makefiles... no
checking for pkg-config... /usr/local/bin/pkg-config
checking for GTK+ - version >= 2.0.0... no
*** Could not run GTK+ test program, checking why...
*** The test program failed to compile or link. See the file config.log for the
*** exact error that occured. This usually means GTK+ is incorrectly installed.
configure: error: Cannot find GTK: Is gtk-config in path?

D'après mes recherches il faut changer le chemin d'accès au gtk-config. Mais je ne sais pas ou il faut faire ce changement.Je crois que c'est une question assez rébarbative.Dsl!ça fait 3 semaines que je suis sur Linux.

Hors ligne

#2 Le 31/01/2006, à 21:26

lemerou

Re : configure: error: Cannot find GTK: Is gtk-config in path?

cherche les paquets de developpement pour gtk dans synaptic, ils sont signalés par un dev dans leur nom

il faut savoir que c'est toujours une question de package lors d'un ./configure et il faut generalement cherché le nom du truc qu'il trouve pas dans synaptic

Dernière modification par lemerou (Le 31/01/2006, à 21:28)


RAZIA: LA rAdio ÉtudiAnte de LAVAL (53) : http://www.radiorazia.com

Hors ligne

#3 Le 31/01/2006, à 21:45

Achille

Re : configure: error: Cannot find GTK: Is gtk-config in path?

En l'occurrence, il te faut installer le paquet libgtk2.0-dev

Hors ligne

#4 Le 02/02/2006, à 23:55

intokabile

Re : configure: error: Cannot find GTK: Is gtk-config in path?

Je l'ai déjà installé et réintaller ce paquet.Mais rien à faire.Il n'arrive toujours pas à trouver le chemin je crois.Même erreur qu'avant.Help please.J'en ai besoin pour installer d'autres logiciels.ça fait seulement  semaines que je suis sur ubuntu alors molo avec les explications

Hors ligne

#5 Le 03/02/2006, à 00:21

mehdicherti

Re : configure: error: Cannot find GTK: Is gtk-config in path?

intokabile a écrit :

Je l'ai déjà installé et réintaller ce paquet.Mais rien à faire.Il n'arrive toujours pas à trouver le chemin je crois.Même erreur qu'avant.Help please.J'en ai besoin pour installer d'autres logiciels.ça fait seulement  semaines que je suis sur ubuntu alors molo avec les explications

salut  , gtk2 n'a plus de gtk-config , il fonctionne seulement avec pkg-config je ne sais pas pourquoi ce driver te demande gtk-config ?

Hors ligne

#6 Le 03/02/2006, à 00:40

intokabile

Re : configure: error: Cannot find GTK: Is gtk-config in path?

Après un peu de lecture dans différents forums,il semblerait que mon libgtk2-dev n'est pas bien installé.Je ne comprends pourquoi.Pourtant je l'ai installé depuis synaptic. Mais toujours pas moyen.Quelqu'un a une idée?

Hors ligne

#7 Le 03/02/2006, à 00:43

intokabile

Re : configure: error: Cannot find GTK: Is gtk-config in path?

Moi non plus je ne comprends pas ce gtk config. Apparemment il est lié au pkg config. Vu que c'est en accédant à ce fichier pkg-config qu'il fait l'erreur. Y a t-il des paquets que je dois supprimer?

Hors ligne

#8 Le 03/02/2006, à 00:44

mehdicherti

Re : configure: error: Cannot find GTK: Is gtk-config in path?

intokabile a écrit :

Après un peu de lecture dans différents forums,il semblerait que mon libgtk2-dev n'est pas bien installé.Je ne comprends pourquoi.Pourtant je l'ai installé depuis synaptic. Mais toujours pas moyen.Quelqu'un a une idée?

je ne crois pas que ton package n'est pas bien installé , voici les fichier que contient libgtk2.0-dev:

/.
/usr
/usr/bin
/usr/bin/gdk-pixbuf-csource
/usr/include
/usr/include/gtk-2.0
/usr/include/gtk-2.0/gdk-pixbuf
/usr/include/gtk-2.0/gdk-pixbuf/gdk-pixbuf.h
/usr/include/gtk-2.0/gdk-pixbuf/gdk-pixbuf-core.h
/usr/include/gtk-2.0/gdk-pixbuf/gdk-pixbuf-transform.h
/usr/include/gtk-2.0/gdk-pixbuf/gdk-pixbuf-io.h
/usr/include/gtk-2.0/gdk-pixbuf/gdk-pixbuf-animation.h
/usr/include/gtk-2.0/gdk-pixbuf/gdk-pixbuf-simple-anim.h
/usr/include/gtk-2.0/gdk-pixbuf/gdk-pixbuf-loader.h
/usr/include/gtk-2.0/gdk-pixbuf/gdk-pixbuf-enum-types.h
/usr/include/gtk-2.0/gdk-pixbuf/gdk-pixbuf-marshal.h
/usr/include/gtk-2.0/gdk-pixbuf/gdk-pixbuf-features.h
/usr/include/gtk-2.0/gdk-pixbuf/gdk-pixdata.h
/usr/include/gtk-2.0/gdk
/usr/include/gtk-2.0/gdk/gdkx.h
/usr/include/gtk-2.0/gdk/gdk.h
/usr/include/gtk-2.0/gdk/gdkcairo.h
/usr/include/gtk-2.0/gdk/gdkcolor.h
/usr/include/gtk-2.0/gdk/gdkcursor.h
/usr/include/gtk-2.0/gdk/gdkdisplay.h
/usr/include/gtk-2.0/gdk/gdkdnd.h
/usr/include/gtk-2.0/gdk/gdkdrawable.h
/usr/include/gtk-2.0/gdk/gdkevents.h
/usr/include/gtk-2.0/gdk/gdkfont.h
/usr/include/gtk-2.0/gdk/gdkgc.h
/usr/include/gtk-2.0/gdk/gdkkeysyms.h
/usr/include/gtk-2.0/gdk/gdki18n.h
/usr/include/gtk-2.0/gdk/gdkimage.h
/usr/include/gtk-2.0/gdk/gdkinput.h
/usr/include/gtk-2.0/gdk/gdkkeys.h
/usr/include/gtk-2.0/gdk/gdkdisplaymanager.h
/usr/include/gtk-2.0/gdk/gdkpango.h
/usr/include/gtk-2.0/gdk/gdkpixbuf.h
/usr/include/gtk-2.0/gdk/gdkpixmap.h
/usr/include/gtk-2.0/gdk/gdkproperty.h
/usr/include/gtk-2.0/gdk/gdkregion.h
/usr/include/gtk-2.0/gdk/gdkrgb.h
/usr/include/gtk-2.0/gdk/gdkscreen.h
/usr/include/gtk-2.0/gdk/gdkselection.h
/usr/include/gtk-2.0/gdk/gdkspawn.h
/usr/include/gtk-2.0/gdk/gdktypes.h
/usr/include/gtk-2.0/gdk/gdkvisual.h
/usr/include/gtk-2.0/gdk/gdkwindow.h
/usr/include/gtk-2.0/gdk/gdkenumtypes.h
/usr/include/gtk-2.0/gdk/gdkprivate.h
/usr/include/gtk-2.0/gdk/gdkalias.h
/usr/include/gtk-2.0/gtk
/usr/include/gtk-2.0/gtk/gtk.h
/usr/include/gtk-2.0/gtk/gtkaboutdialog.h
/usr/include/gtk-2.0/gtk/gtkaccelgroup.h
/usr/include/gtk-2.0/gtk/gtkaccellabel.h
/usr/include/gtk-2.0/gtk/gtkaccelmap.h
/usr/include/gtk-2.0/gtk/gtkaccessible.h
/usr/include/gtk-2.0/gtk/gtkaction.h
/usr/include/gtk-2.0/gtk/gtkactiongroup.h
/usr/include/gtk-2.0/gtk/gtkadjustment.h
/usr/include/gtk-2.0/gtk/gtkalignment.h
/usr/include/gtk-2.0/gtk/gtkarrow.h
/usr/include/gtk-2.0/gtk/gtkaspectframe.h
/usr/include/gtk-2.0/gtk/gtkbbox.h
/usr/include/gtk-2.0/gtk/gtkbin.h
/usr/include/gtk-2.0/gtk/gtkbindings.h
/usr/include/gtk-2.0/gtk/gtkbox.h
/usr/include/gtk-2.0/gtk/gtkbutton.h
/usr/include/gtk-2.0/gtk/gtkcalendar.h
/usr/include/gtk-2.0/gtk/gtkcelleditable.h
/usr/include/gtk-2.0/gtk/gtkcelllayout.h
/usr/include/gtk-2.0/gtk/gtkcellrenderer.h
/usr/include/gtk-2.0/gtk/gtkcellrenderercombo.h
/usr/include/gtk-2.0/gtk/gtkcellrendererpixbuf.h
/usr/include/gtk-2.0/gtk/gtkcellrendererprogress.h
/usr/include/gtk-2.0/gtk/gtkcellrenderertext.h
/usr/include/gtk-2.0/gtk/gtkcellrenderertoggle.h
/usr/include/gtk-2.0/gtk/gtkcellview.h
/usr/include/gtk-2.0/gtk/gtkcheckbutton.h
/usr/include/gtk-2.0/gtk/gtkcheckmenuitem.h
/usr/include/gtk-2.0/gtk/gtkclipboard.h
/usr/include/gtk-2.0/gtk/gtkclist.h
/usr/include/gtk-2.0/gtk/gtkcolorbutton.h
/usr/include/gtk-2.0/gtk/gtkcolorsel.h
/usr/include/gtk-2.0/gtk/gtkcolorseldialog.h
/usr/include/gtk-2.0/gtk/gtkcombo.h
/usr/include/gtk-2.0/gtk/gtkcombobox.h
/usr/include/gtk-2.0/gtk/gtkcomboboxentry.h
/usr/include/gtk-2.0/gtk/gtkcontainer.h
/usr/include/gtk-2.0/gtk/gtkctree.h
/usr/include/gtk-2.0/gtk/gtkcurve.h
/usr/include/gtk-2.0/gtk/gtkdebug.h
/usr/include/gtk-2.0/gtk/gtkdialog.h
/usr/include/gtk-2.0/gtk/gtkdnd.h
/usr/include/gtk-2.0/gtk/gtkdrawingarea.h
/usr/include/gtk-2.0/gtk/gtkeditable.h
/usr/include/gtk-2.0/gtk/gtkentry.h
/usr/include/gtk-2.0/gtk/gtkentrycompletion.h
/usr/include/gtk-2.0/gtk/gtkenums.h
/usr/include/gtk-2.0/gtk/gtkeventbox.h
/usr/include/gtk-2.0/gtk/gtkexpander.h
/usr/include/gtk-2.0/gtk/gtkfilechooser.h
/usr/include/gtk-2.0/gtk/gtkfilechooserbutton.h
/usr/include/gtk-2.0/gtk/gtkfilechooserdialog.h
/usr/include/gtk-2.0/gtk/gtkfilechooserwidget.h
/usr/include/gtk-2.0/gtk/gtkfilefilter.h
/usr/include/gtk-2.0/gtk/gtkfilesel.h
/usr/include/gtk-2.0/gtk/gtkfixed.h
/usr/include/gtk-2.0/gtk/gtkfontbutton.h
/usr/include/gtk-2.0/gtk/gtkfontsel.h
/usr/include/gtk-2.0/gtk/gtkframe.h
/usr/include/gtk-2.0/gtk/gtkgamma.h
/usr/include/gtk-2.0/gtk/gtkgc.h
/usr/include/gtk-2.0/gtk/gtkhandlebox.h
/usr/include/gtk-2.0/gtk/gtkhbbox.h
/usr/include/gtk-2.0/gtk/gtkhbox.h
/usr/include/gtk-2.0/gtk/gtkhpaned.h
/usr/include/gtk-2.0/gtk/gtkhruler.h
/usr/include/gtk-2.0/gtk/gtkhscale.h
/usr/include/gtk-2.0/gtk/gtkhscrollbar.h
/usr/include/gtk-2.0/gtk/gtkhseparator.h
/usr/include/gtk-2.0/gtk/gtkiconfactory.h
/usr/include/gtk-2.0/gtk/gtkicontheme.h
/usr/include/gtk-2.0/gtk/gtkiconview.h
/usr/include/gtk-2.0/gtk/gtkimage.h
/usr/include/gtk-2.0/gtk/gtkimagemenuitem.h
/usr/include/gtk-2.0/gtk/gtkimcontext.h
/usr/include/gtk-2.0/gtk/gtkimcontextsimple.h
/usr/include/gtk-2.0/gtk/gtkimmodule.h
/usr/include/gtk-2.0/gtk/gtkimmulticontext.h
/usr/include/gtk-2.0/gtk/gtkinputdialog.h
/usr/include/gtk-2.0/gtk/gtkinvisible.h
/usr/include/gtk-2.0/gtk/gtkitem.h
/usr/include/gtk-2.0/gtk/gtkitemfactory.h
/usr/include/gtk-2.0/gtk/gtklabel.h
/usr/include/gtk-2.0/gtk/gtklayout.h
/usr/include/gtk-2.0/gtk/gtklist.h
/usr/include/gtk-2.0/gtk/gtklistitem.h
/usr/include/gtk-2.0/gtk/gtkliststore.h
/usr/include/gtk-2.0/gtk/gtkmain.h
/usr/include/gtk-2.0/gtk/gtkmenu.h
/usr/include/gtk-2.0/gtk/gtkmenubar.h
/usr/include/gtk-2.0/gtk/gtkmenuitem.h
/usr/include/gtk-2.0/gtk/gtkmenushell.h
/usr/include/gtk-2.0/gtk/gtkmenutoolbutton.h
/usr/include/gtk-2.0/gtk/gtkmessagedialog.h
/usr/include/gtk-2.0/gtk/gtkmisc.h
/usr/include/gtk-2.0/gtk/gtkmodules.h
/usr/include/gtk-2.0/gtk/gtknotebook.h
/usr/include/gtk-2.0/gtk/gtkobject.h
/usr/include/gtk-2.0/gtk/gtkoldeditable.h
/usr/include/gtk-2.0/gtk/gtkoptionmenu.h
/usr/include/gtk-2.0/gtk/gtkpaned.h
/usr/include/gtk-2.0/gtk/gtkpixmap.h
/usr/include/gtk-2.0/gtk/gtkplug.h
/usr/include/gtk-2.0/gtk/gtkpreview.h
/usr/include/gtk-2.0/gtk/gtkprivate.h
/usr/include/gtk-2.0/gtk/gtkprogress.h
/usr/include/gtk-2.0/gtk/gtkprogressbar.h
/usr/include/gtk-2.0/gtk/gtkradioaction.h
/usr/include/gtk-2.0/gtk/gtkradiobutton.h
/usr/include/gtk-2.0/gtk/gtkradiomenuitem.h
/usr/include/gtk-2.0/gtk/gtkradiotoolbutton.h
/usr/include/gtk-2.0/gtk/gtkrange.h
/usr/include/gtk-2.0/gtk/gtkrc.h
/usr/include/gtk-2.0/gtk/gtkruler.h
/usr/include/gtk-2.0/gtk/gtkscale.h
/usr/include/gtk-2.0/gtk/gtkscrollbar.h
/usr/include/gtk-2.0/gtk/gtkscrolledwindow.h
/usr/include/gtk-2.0/gtk/gtkselection.h
/usr/include/gtk-2.0/gtk/gtkseparator.h
/usr/include/gtk-2.0/gtk/gtkseparatormenuitem.h
/usr/include/gtk-2.0/gtk/gtkseparatortoolitem.h
/usr/include/gtk-2.0/gtk/gtksettings.h
/usr/include/gtk-2.0/gtk/gtksignal.h
/usr/include/gtk-2.0/gtk/gtksizegroup.h
/usr/include/gtk-2.0/gtk/gtksocket.h
/usr/include/gtk-2.0/gtk/gtkspinbutton.h
/usr/include/gtk-2.0/gtk/gtkstatusbar.h
/usr/include/gtk-2.0/gtk/gtkstock.h
/usr/include/gtk-2.0/gtk/gtkstyle.h
/usr/include/gtk-2.0/gtk/gtktable.h
/usr/include/gtk-2.0/gtk/gtktearoffmenuitem.h
/usr/include/gtk-2.0/gtk/gtktext.h
/usr/include/gtk-2.0/gtk/gtktextbuffer.h
/usr/include/gtk-2.0/gtk/gtktextchild.h
/usr/include/gtk-2.0/gtk/gtktextdisplay.h
/usr/include/gtk-2.0/gtk/gtktextiter.h
/usr/include/gtk-2.0/gtk/gtktextmark.h
/usr/include/gtk-2.0/gtk/gtktexttag.h
/usr/include/gtk-2.0/gtk/gtktexttagtable.h
/usr/include/gtk-2.0/gtk/gtktextview.h
/usr/include/gtk-2.0/gtk/gtktipsquery.h
/usr/include/gtk-2.0/gtk/gtktoggleaction.h
/usr/include/gtk-2.0/gtk/gtktogglebutton.h
/usr/include/gtk-2.0/gtk/gtktoggletoolbutton.h
/usr/include/gtk-2.0/gtk/gtktoolbar.h
/usr/include/gtk-2.0/gtk/gtktoolbutton.h
/usr/include/gtk-2.0/gtk/gtktoolitem.h
/usr/include/gtk-2.0/gtk/gtktooltips.h
/usr/include/gtk-2.0/gtk/gtktree.h
/usr/include/gtk-2.0/gtk/gtktreednd.h
/usr/include/gtk-2.0/gtk/gtktreeitem.h
/usr/include/gtk-2.0/gtk/gtktreemodel.h
/usr/include/gtk-2.0/gtk/gtktreemodelfilter.h
/usr/include/gtk-2.0/gtk/gtktreemodelsort.h
/usr/include/gtk-2.0/gtk/gtktreeselection.h
/usr/include/gtk-2.0/gtk/gtktreesortable.h
/usr/include/gtk-2.0/gtk/gtktreestore.h
/usr/include/gtk-2.0/gtk/gtktreeview.h
/usr/include/gtk-2.0/gtk/gtktreeviewcolumn.h
/usr/include/gtk-2.0/gtk/gtktypeutils.h
/usr/include/gtk-2.0/gtk/gtkuimanager.h
/usr/include/gtk-2.0/gtk/gtkvbbox.h
/usr/include/gtk-2.0/gtk/gtkvbox.h
/usr/include/gtk-2.0/gtk/gtkviewport.h
/usr/include/gtk-2.0/gtk/gtkvpaned.h
/usr/include/gtk-2.0/gtk/gtkvruler.h
/usr/include/gtk-2.0/gtk/gtkvscale.h
/usr/include/gtk-2.0/gtk/gtkvscrollbar.h
/usr/include/gtk-2.0/gtk/gtkvseparator.h
/usr/include/gtk-2.0/gtk/gtkwidget.h
/usr/include/gtk-2.0/gtk/gtkwindow.h
/usr/include/gtk-2.0/gtk/gtktextlayout.h
/usr/include/gtk-2.0/gtk/gtkfilesystem.h
/usr/include/gtk-2.0/gtk/gtkmarshal.h
/usr/include/gtk-2.0/gtk/gtktypebuiltins.h
/usr/include/gtk-2.0/gtk/gtkversion.h
/usr/include/gtk-2.0/gdk-pixbuf-xlib
/usr/include/gtk-2.0/gdk-pixbuf-xlib/gdk-pixbuf-xlib.h
/usr/include/gtk-2.0/gdk-pixbuf-xlib/gdk-pixbuf-xlibrgb.h
/usr/lib
/usr/lib/pkgconfig
/usr/lib/pkgconfig/gdk-2.0.pc
/usr/lib/pkgconfig/gdk-pixbuf-2.0.pc
/usr/lib/pkgconfig/gdk-pixbuf-xlib-2.0.pc
/usr/lib/pkgconfig/gdk-x11-2.0.pc
/usr/lib/pkgconfig/gtk+-2.0.pc
/usr/lib/pkgconfig/gtk+-x11-2.0.pc
/usr/lib/libgdk-x11-2.0.la
/usr/lib/libgdk_pixbuf-2.0.la
/usr/lib/libgdk_pixbuf_xlib-2.0.la
/usr/lib/libgtk-x11-2.0.la
/usr/lib/libgdk-x11-2.0.a
/usr/lib/libgdk_pixbuf-2.0.a
/usr/lib/libgdk_pixbuf_xlib-2.0.a
/usr/lib/libgtk-x11-2.0.a
/usr/lib/gtk-2.0
/usr/lib/gtk-2.0/2.4.0
/usr/lib/gtk-2.0/2.4.0/loaders
/usr/lib/gtk-2.0/2.4.0/loaders/libpixbufloader-ani.la
/usr/lib/gtk-2.0/2.4.0/loaders/libpixbufloader-bmp.la
/usr/lib/gtk-2.0/2.4.0/loaders/libpixbufloader-gif.la
/usr/lib/gtk-2.0/2.4.0/loaders/libpixbufloader-ico.la
/usr/lib/gtk-2.0/2.4.0/loaders/libpixbufloader-jpeg.la
/usr/lib/gtk-2.0/2.4.0/loaders/libpixbufloader-pcx.la
/usr/lib/gtk-2.0/2.4.0/loaders/libpixbufloader-png.la
/usr/lib/gtk-2.0/2.4.0/loaders/libpixbufloader-pnm.la
/usr/lib/gtk-2.0/2.4.0/loaders/libpixbufloader-ras.la
/usr/lib/gtk-2.0/2.4.0/loaders/libpixbufloader-tga.la
/usr/lib/gtk-2.0/2.4.0/loaders/libpixbufloader-tiff.la
/usr/lib/gtk-2.0/2.4.0/loaders/libpixbufloader-wbmp.la
/usr/lib/gtk-2.0/2.4.0/loaders/libpixbufloader-xbm.la
/usr/lib/gtk-2.0/2.4.0/loaders/libpixbufloader-xpm.la
/usr/lib/gtk-2.0/2.4.0/immodules
/usr/lib/gtk-2.0/2.4.0/immodules/im-am-et.la
/usr/lib/gtk-2.0/2.4.0/immodules/im-cedilla.la
/usr/lib/gtk-2.0/2.4.0/immodules/im-cyrillic-translit.la
/usr/lib/gtk-2.0/2.4.0/immodules/im-inuktitut.la
/usr/lib/gtk-2.0/2.4.0/immodules/im-ipa.la
/usr/lib/gtk-2.0/2.4.0/immodules/im-thai-broken.la
/usr/lib/gtk-2.0/2.4.0/immodules/im-ti-er.la
/usr/lib/gtk-2.0/2.4.0/immodules/im-ti-et.la
/usr/lib/gtk-2.0/2.4.0/immodules/im-viqr.la
/usr/lib/gtk-2.0/2.4.0/immodules/im-xim.la
/usr/lib/gtk-2.0/2.4.0/immodules/im-am-et.a
/usr/lib/gtk-2.0/2.4.0/immodules/im-cedilla.a
/usr/lib/gtk-2.0/2.4.0/immodules/im-cyrillic-translit.a
/usr/lib/gtk-2.0/2.4.0/immodules/im-inuktitut.a
/usr/lib/gtk-2.0/2.4.0/immodules/im-ipa.a
/usr/lib/gtk-2.0/2.4.0/immodules/im-thai-broken.a
/usr/lib/gtk-2.0/2.4.0/immodules/im-ti-er.a
/usr/lib/gtk-2.0/2.4.0/immodules/im-ti-et.a
/usr/lib/gtk-2.0/2.4.0/immodules/im-viqr.a
/usr/lib/gtk-2.0/2.4.0/immodules/im-xim.a
/usr/lib/gtk-2.0/include
/usr/lib/gtk-2.0/include/gdkconfig.h
/usr/share
/usr/share/aclocal
/usr/share/aclocal/gtk-2.0.m4
/usr/share/man
/usr/share/man/man1
/usr/share/man/man1/gdk-pixbuf-csource.1.gz
/usr/share/doc
/usr/lib/libgdk-x11-2.0.so
/usr/lib/libgdk_pixbuf-2.0.so
/usr/lib/libgdk_pixbuf_xlib-2.0.so
/usr/lib/libgtk-x11-2.0.so
/usr/share/doc/libgtk2.0-dev

Or il n'y a pas du tout de "gtk-config" normalement le fichier  configure doit utilise pkgconfig

Dernière modification par mehdicherti (Le 03/02/2006, à 00:45)

Hors ligne

#9 Le 03/02/2006, à 09:43

intokabile

Re : configure: error: Cannot find GTK: Is gtk-config in path?

Quelle est la solution pour remédier à ce problème?

Hors ligne

#10 Le 03/02/2006, à 12:16

lemerou

Re : configure: error: Cannot find GTK: Is gtk-config in path?

y'a quoi dans le config.log du configure ?


RAZIA: LA rAdio ÉtudiAnte de LAVAL (53) : http://www.radiorazia.com

Hors ligne

#11 Le 03/02/2006, à 17:59

intokabile

Re : configure: error: Cannot find GTK: Is gtk-config in path?

Voici le config.log

This file contains any messages produced by compilers while
running configure, to aid debugging if configure makes a mistake.

It was created by configure, which was
generated by GNU Autoconf 2.57.  Invocation command line was

  $ ./configure 

## --------- ##
## Platform. ##
## --------- ##

hostname = ubuntu
uname -m = i686
uname -r = 2.6.12-10-386
uname -s = Linux
uname -v = #1 Mon Jan 16 17:18:08 UTC 2006

/usr/bin/uname -p = unknown
/bin/uname -X     = unknown

/bin/arch              = i686
/usr/bin/arch -k       = unknown
/usr/convex/getsysinfo = unknown
hostinfo               = unknown
/bin/machine           = unknown
/usr/bin/oslevel       = unknown
/bin/universe          = unknown

PATH: /usr/local/bin
PATH: /usr/local/sbin
PATH: /sbin
PATH: /usr/sbin
PATH: /bin
PATH: /usr/bin
PATH: /usr/bin/X11
PATH: /usr/games


## ----------- ##
## Core tests. ##
## ----------- ##

configure:1273: checking for a BSD-compatible install
configure:1327: result: /usr/bin/install -c
configure:1338: checking whether build environment is sane
configure:1381: result: yes
configure:1414: checking for gawk
configure:1430: found /usr/bin/gawk
configure:1440: result: gawk
configure:1450: checking whether make sets $(MAKE)
configure:1470: result: yes
configure:1647: checking for style of include used by make
configure:1675: result: GNU
configure:1746: checking for gcc
configure:1762: found /usr/bin/gcc
configure:1772: result: gcc
configure:2016: checking for C compiler version
configure:2019: gcc --version </dev/null >&5
gcc (GCC) 4.0.2 20050808 (prerelease) (Ubuntu 4.0.1-4ubuntu9)
Copyright (C) 2005 Free Software Foundation, Inc.
This is free software; see the source for copying conditions.  There is NO
warranty; not even for MERCHANTABILITY or FITNESS FOR A PARTICULAR PURPOSE.

configure:2022: $? = 0
configure:2024: gcc -v </dev/null >&5
Using built-in specs.
Target: i486-linux-gnu
Configured with: ../src/configure -v --enable-languages=c,c++,java,f95,objc,ada,treelang --prefix=/usr --with-gxx-include-dir=/usr/include/c++/4.0.2 --enable-shared --with-system-zlib --libexecdir=/usr/lib --enable-nls --without-included-gettext --enable-threads=posix --program-suffix=-4.0 --enable-__cxa_atexit --enable-libstdcxx-allocator=mt --enable-clocale=gnu --enable-libstdcxx-debug --enable-java-gc=boehm --enable-java-awt=gtk --enable-gtk-cairo --with-java-home=/usr/lib/jvm/java-1.4.2-gcj-4.0-1.4.2.0/jre --enable-mpfr --disable-werror --enable-checking=release i486-linux-gnu
Thread model: posix
gcc version 4.0.2 20050808 (prerelease) (Ubuntu 4.0.1-4ubuntu9)
configure:2027: $? = 0
configure:2029: gcc -V </dev/null >&5
gcc: '-V' option must have argument
configure:2032: $? = 1
configure:2056: checking for C compiler default output
configure:2059: gcc    conftest.c  >&5
configure:2062: $? = 0
configure:2108: result: a.out
configure:2113: checking whether the C compiler works
configure:2119: ./a.out
configure:2122: $? = 0
configure:2139: result: yes
configure:2146: checking whether we are cross compiling
configure:2148: result: no
configure:2151: checking for suffix of executables
configure:2153: gcc -o conftest    conftest.c  >&5
configure:2156: $? = 0
configure:2181: result: 
configure:2187: checking for suffix of object files
configure:2209: gcc -c   conftest.c >&5
configure:2212: $? = 0
configure:2234: result: o
configure:2238: checking whether we are using the GNU C compiler
configure:2263: gcc -c   conftest.c >&5
configure:2266: $? = 0
configure:2269: test -s conftest.o
configure:2272: $? = 0
configure:2285: result: yes
configure:2291: checking whether gcc accepts -g
configure:2313: gcc -c -g  conftest.c >&5
configure:2316: $? = 0
configure:2319: test -s conftest.o
configure:2322: $? = 0
configure:2333: result: yes
configure:2350: checking for gcc option to accept ANSI C
configure:2411: gcc  -c -g -O2  conftest.c >&5
configure:2414: $? = 0
configure:2417: test -s conftest.o
configure:2420: $? = 0
configure:2438: result: none needed
configure:2456: gcc -c -g -O2  conftest.c >&5
conftest.c:2: error: syntax error before 'me'
configure:2459: $? = 1
configure: failed program was:
| #ifndef __cplusplus
|   choke me
| #endif
configure:2570: checking dependency style of gcc
configure:2653: result: gcc3
configure:2672: checking for strerror in -lcposix
configure:2703: gcc -o conftest -g -O2   conftest.c -lcposix   >&5
/usr/bin/ld: cannot find -lcposix
collect2: ld returned 1 exit status
configure:2706: $? = 1
configure: failed program was:
| #line 2679 "configure"
| /* confdefs.h.  */
| 
| #define PACKAGE_NAME ""
| #define PACKAGE_TARNAME ""
| #define PACKAGE_VERSION ""
| #define PACKAGE_STRING ""
| #define PACKAGE_BUGREPORT ""
| #define PACKAGE "z42tool"
| #define VERSION "0.4.3"
| /* end confdefs.h.  */
| 
| /* Override any gcc2 internal prototype to avoid an error.  */
| #ifdef __cplusplus
| extern "C"
| #endif
| /* We use char because int might match the return type of a gcc2
|    builtin and then its argument prototype would still apply.  */
| char strerror ();
| int
| main ()
| {
| strerror ();
|   ;
|   return 0;
| }
configure:2724: result: no
configure:2778: checking for gcc
configure:2804: result: gcc
configure:3048: checking for C compiler version
configure:3051: gcc --version </dev/null >&5
gcc (GCC) 4.0.2 20050808 (prerelease) (Ubuntu 4.0.1-4ubuntu9)
Copyright (C) 2005 Free Software Foundation, Inc.
This is free software; see the source for copying conditions.  There is NO
warranty; not even for MERCHANTABILITY or FITNESS FOR A PARTICULAR PURPOSE.

configure:3054: $? = 0
configure:3056: gcc -v </dev/null >&5
Using built-in specs.
Target: i486-linux-gnu
Configured with: ../src/configure -v --enable-languages=c,c++,java,f95,objc,ada,treelang --prefix=/usr --with-gxx-include-dir=/usr/include/c++/4.0.2 --enable-shared --with-system-zlib --libexecdir=/usr/lib --enable-nls --without-included-gettext --enable-threads=posix --program-suffix=-4.0 --enable-__cxa_atexit --enable-libstdcxx-allocator=mt --enable-clocale=gnu --enable-libstdcxx-debug --enable-java-gc=boehm --enable-java-awt=gtk --enable-gtk-cairo --with-java-home=/usr/lib/jvm/java-1.4.2-gcj-4.0-1.4.2.0/jre --enable-mpfr --disable-werror --enable-checking=release i486-linux-gnu
Thread model: posix
gcc version 4.0.2 20050808 (prerelease) (Ubuntu 4.0.1-4ubuntu9)
configure:3059: $? = 0
configure:3061: gcc -V </dev/null >&5
gcc: '-V' option must have argument
configure:3064: $? = 1
configure:3067: checking whether we are using the GNU C compiler
configure:3114: result: yes
configure:3120: checking whether gcc accepts -g
configure:3162: result: yes
configure:3179: checking for gcc option to accept ANSI C
configure:3267: result: none needed
configure:3285: gcc -c -g -O2  conftest.c >&5
conftest.c:2: error: syntax error before 'me'
configure:3288: $? = 1
configure: failed program was:
| #ifndef __cplusplus
|   choke me
| #endif
configure:3399: checking dependency style of gcc
configure:3482: result: gcc3
configure:3502: checking for gcc option to accept ANSI C
configure:3566: gcc  -c -g -O2  conftest.c >&5
configure:3569: $? = 0
configure:3572: test -s conftest.o
configure:3575: $? = 0
configure:3590: result: none needed
configure:3606: checking how to run the C preprocessor
configure:3642: gcc -E  conftest.c
configure:3648: $? = 0
configure:3680: gcc -E  conftest.c
configure:3681:28: error: ac_nonexistent.h: No such file or directory
configure:3686: $? = 1
configure: failed program was:
| #line 3671 "configure"
| /* confdefs.h.  */
| 
| #define PACKAGE_NAME ""
| #define PACKAGE_TARNAME ""
| #define PACKAGE_VERSION ""
| #define PACKAGE_STRING ""
| #define PACKAGE_BUGREPORT ""
| #define PACKAGE "z42tool"
| #define VERSION "0.4.3"
| /* end confdefs.h.  */
| #include <ac_nonexistent.h>
configure:3724: result: gcc -E
configure:3749: gcc -E  conftest.c
configure:3755: $? = 0
configure:3787: gcc -E  conftest.c
configure:3788:28: error: ac_nonexistent.h: No such file or directory
configure:3793: $? = 1
configure: failed program was:
| #line 3778 "configure"
| /* confdefs.h.  */
| 
| #define PACKAGE_NAME ""
| #define PACKAGE_TARNAME ""
| #define PACKAGE_VERSION ""
| #define PACKAGE_STRING ""
| #define PACKAGE_BUGREPORT ""
| #define PACKAGE "z42tool"
| #define VERSION "0.4.3"
| /* end confdefs.h.  */
| #include <ac_nonexistent.h>
configure:3836: checking for egrep
configure:3846: result: grep -E
configure:3851: checking for ANSI C header files
configure:3877: gcc -c -g -O2  conftest.c >&5
configure:3880: $? = 0
configure:3883: test -s conftest.o
configure:3886: $? = 0
configure:3978: gcc -o conftest -g -O2   conftest.c  >&5
configure: In function 'main':
configure:3973: warning: incompatible implicit declaration of built-in function 'exit'
configure:3981: $? = 0
configure:3983: ./conftest
configure:3986: $? = 0
configure:4001: result: yes
configure:4012: checking whether to enable maintainer-specific portions of Makefiles
configure:4021: result: no
configure:4059: checking for pkg-config
configure:4077: found /usr/local/bin/pkg-config
configure:4090: result: /usr/local/bin/pkg-config
configure:4111: checking for GTK+ - version >= 2.0.0
configure:4257: result: no
configure:4291: gcc -o conftest -g -O2    conftest.c   >&5
configure:4283:21: error: gtk/gtk.h: No such file or directory
configure: In function 'main':
configure:4289: error: 'gtk_major_version' undeclared (first use in this function)
configure:4289: error: (Each undeclared identifier is reported only once
configure:4289: error: for each function it appears in.)
configure:4289: error: 'gtk_minor_version' undeclared (first use in this function)
configure:4289: error: 'gtk_micro_version' undeclared (first use in this function)
configure:4294: $? = 1
configure: failed program was:
| #line 4271 "configure"
| /* confdefs.h.  */
| 
| #define PACKAGE_NAME ""
| #define PACKAGE_TARNAME ""
| #define PACKAGE_VERSION ""
| #define PACKAGE_STRING ""
| #define PACKAGE_BUGREPORT ""
| #define PACKAGE "z42tool"
| #define VERSION "0.4.3"
| #define STDC_HEADERS 1
| /* end confdefs.h.  */
| 
| #include <gtk/gtk.h>
| #include <stdio.h>
| 
| int
| main ()
| {
|  return ((gtk_major_version) || (gtk_minor_version) || (gtk_micro_version));
|   ;
|   return 0;
| }
configure:4325: error: Cannot find GTK: Is gtk-config in path?

## ---------------- ##
## Cache variables. ##
## ---------------- ##

ac_cv_c_compiler_gnu=yes
ac_cv_env_CC_set=
ac_cv_env_CC_value=
ac_cv_env_CFLAGS_set=
ac_cv_env_CFLAGS_value=
ac_cv_env_CPPFLAGS_set=
ac_cv_env_CPPFLAGS_value=
ac_cv_env_CPP_set=
ac_cv_env_CPP_value=
ac_cv_env_LDFLAGS_set=
ac_cv_env_LDFLAGS_value=
ac_cv_env_build_alias_set=
ac_cv_env_build_alias_value=
ac_cv_env_host_alias_set=
ac_cv_env_host_alias_value=
ac_cv_env_target_alias_set=
ac_cv_env_target_alias_value=
ac_cv_exeext=
ac_cv_header_stdc=yes
ac_cv_lib_cposix_strerror=no
ac_cv_objext=o
ac_cv_path_PKG_CONFIG=/usr/local/bin/pkg-config
ac_cv_path_install='/usr/bin/install -c'
ac_cv_prog_AWK=gawk
ac_cv_prog_CPP='gcc -E'
ac_cv_prog_ac_ct_CC=gcc
ac_cv_prog_cc_g=yes
ac_cv_prog_cc_stdc=
ac_cv_prog_egrep='grep -E'
ac_cv_prog_make_make_set=yes
am_cv_CC_dependencies_compiler_type=gcc3
am_cv_prog_cc_stdc=

## ----------------- ##
## Output variables. ##
## ----------------- ##

ACLOCAL='${SHELL} /home/intokabile/Desktop/DownloadedFiles/drv_z42/z42tool/missing --run aclocal-1.7'
AMDEPBACKSLASH='\'
AMDEP_FALSE='#'
AMDEP_TRUE=''
AMTAR='${SHELL} /home/intokabile/Desktop/DownloadedFiles/drv_z42/z42tool/missing --run tar'
AUTOCONF='${SHELL} /home/intokabile/Desktop/DownloadedFiles/drv_z42/z42tool/missing --run autoconf'
AUTOHEADER='${SHELL} /home/intokabile/Desktop/DownloadedFiles/drv_z42/z42tool/missing --run autoheader'
AUTOMAKE='${SHELL} /home/intokabile/Desktop/DownloadedFiles/drv_z42/z42tool/missing --run automake-1.7'
AWK='gawk'
CC='gcc'
CCDEPMODE='depmode=gcc3'
CFLAGS='-g -O2'
CPP='gcc -E'
CPPFLAGS=''
CYGPATH_W='echo'
DEFS=''
DEPDIR='.deps'
ECHO_C=''
ECHO_N='-n'
ECHO_T=''
EGREP='grep -E'
EXEEXT=''
GTK_CFLAGS=''
GTK_LIBS=''
INSTALL_DATA='${INSTALL} -m 644'
INSTALL_PROGRAM='${INSTALL}'
INSTALL_SCRIPT='${INSTALL}'
INSTALL_STRIP_PROGRAM='${SHELL} $(install_sh) -c -s'
LDFLAGS=''
LIBOBJS=''
LIBS=''
LTLIBOBJS=''
MAINT='#'
MAINTAINER_MODE_FALSE=''
MAINTAINER_MODE_TRUE='#'
MAKEINFO='${SHELL} /home/intokabile/Desktop/DownloadedFiles/drv_z42/z42tool/missing --run makeinfo'
OBJEXT='o'
PACKAGE='z42tool'
PACKAGE_BUGREPORT=''
PACKAGE_NAME=''
PACKAGE_STRING=''
PACKAGE_TARNAME=''
PACKAGE_VERSION=''
PATH_SEPARATOR=':'
PKG_CONFIG='/usr/local/bin/pkg-config'
SET_MAKE=''
SHELL='/bin/sh'
STRIP=''
VERSION='0.4.3'
ac_ct_CC='gcc'
ac_ct_STRIP=''
am__fastdepCC_FALSE='#'
am__fastdepCC_TRUE=''
am__include='include'
am__leading_dot='.'
am__quote=''
bindir='${exec_prefix}/bin'
build_alias=''
datadir='${prefix}/share'
exec_prefix='NONE'
host_alias=''
includedir='${prefix}/include'
infodir='${prefix}/info'
install_sh='/home/intokabile/Desktop/DownloadedFiles/drv_z42/z42tool/install-sh'
libdir='${exec_prefix}/lib'
libexecdir='${exec_prefix}/libexec'
localstatedir='${prefix}/var'
mandir='${prefix}/man'
oldincludedir='/usr/include'
prefix='NONE'
program_transform_name='s,x,x,'
sbindir='${exec_prefix}/sbin'
sharedstatedir='${prefix}/com'
sysconfdir='${prefix}/etc'
target_alias=''

## ----------- ##
## confdefs.h. ##
## ----------- ##

#define PACKAGE "z42tool"
#define PACKAGE_BUGREPORT ""
#define PACKAGE_NAME ""
#define PACKAGE_STRING ""
#define PACKAGE_TARNAME ""
#define PACKAGE_VERSION ""
#define STDC_HEADERS 1
#define VERSION "0.4.3"

configure: exit 1

Hors ligne

#12 Le 03/02/2006, à 18:04

gpocentek

Re : configure: error: Cannot find GTK: Is gtk-config in path?

gtk-config c'est du gtk1, pas gu gtk2.
Le paquet est libgtk1.2-dev

Hors ligne

#13 Le 03/02/2006, à 18:09

mehdicherti

Re : configure: error: Cannot find GTK: Is gtk-config in path?

Gloubiboulga a écrit :

gtk-config c'est du gtk1, pas gu gtk2.
Le paquet est libgtk1.2-dev

oui c'est ce que je ne comprends pas,
la source utilise gtk2 et demande gtk-config alors que dans gtk2 on utilise plus gtk-config mais pkgconfig

Hors ligne

#14 Le 03/02/2006, à 19:16

intokabile

Re : configure: error: Cannot find GTK: Is gtk-config in path?

Je l'ai déjà installer et reinstaller au cas ou il aurait été mal installé.Mais rien à faire

Hors ligne

#15 Le 03/02/2006, à 20:31

lemerou

Re : configure: error: Cannot find GTK: Is gtk-config in path?

Hum je pense que tu a essayer de faire une install a la main du gtk dev car dans ton configure tu as :

checking for pkg-config... /usr/local/bin/pkg-config

au lieu de

checking for pkg-config... /usr/bin/pkg-config

je pense que tu as deux pkg-config et le probleme vient surement de là

Dernière modification par lemerou (Le 03/02/2006, à 20:31)


RAZIA: LA rAdio ÉtudiAnte de LAVAL (53) : http://www.radiorazia.com

Hors ligne

#16 Le 05/02/2006, à 19:58

intokabile

Re : configure: error: Cannot find GTK: Is gtk-config in path?

Comment je fais pour retirer le "mauvais" paquet?

Hors ligne

#17 Le 05/02/2006, à 20:23

intokabile

Re : configure: error: Cannot find GTK: Is gtk-config in path?

J'ai essayé de désintaller et de reinstaller les paquets pkg-config et libgtk2-dev avec apt-get install et remove. Mais rien à faire?Toujours la même erreur.Quelqu'un a une idée?

Hors ligne

#18 Le 05/02/2006, à 20:30

intokabile

Re : configure: error: Cannot find GTK: Is gtk-config in path?

Voici le nouveau conifg.log

This file contains any messages produced by compilers while
running configure, to aid debugging if configure makes a mistake.

It was created by configure, which was
generated by GNU Autoconf 2.57.  Invocation command line was

  $ ./configure 

## --------- ##
## Platform. ##
## --------- ##

hostname = ubuntu
uname -m = i686
uname -r = 2.6.12-10-386
uname -s = Linux
uname -v = #1 Mon Jan 16 17:18:08 UTC 2006

/usr/bin/uname -p = unknown
/bin/uname -X     = unknown

/bin/arch              = i686
/usr/bin/arch -k       = unknown
/usr/convex/getsysinfo = unknown
hostinfo               = unknown
/bin/machine           = unknown
/usr/bin/oslevel       = unknown
/bin/universe          = unknown

PATH: /usr/local/sbin
PATH: /usr/local/bin
PATH: /usr/sbin
PATH: /usr/bin
PATH: /sbin
PATH: /bin
PATH: /usr/bin/X11


## ----------- ##
## Core tests. ##
## ----------- ##

configure:1273: checking for a BSD-compatible install
configure:1327: result: /usr/bin/install -c
configure:1338: checking whether build environment is sane
configure:1381: result: yes
configure:1414: checking for gawk
configure:1430: found /usr/bin/gawk
configure:1440: result: gawk
configure:1450: checking whether make sets $(MAKE)
configure:1470: result: yes
configure:1647: checking for style of include used by make
configure:1675: result: GNU
configure:1746: checking for gcc
configure:1762: found /usr/bin/gcc
configure:1772: result: gcc
configure:2016: checking for C compiler version
configure:2019: gcc --version </dev/null >&5
gcc (GCC) 4.0.2 20050808 (prerelease) (Ubuntu 4.0.1-4ubuntu9)
Copyright (C) 2005 Free Software Foundation, Inc.
This is free software; see the source for copying conditions.  There is NO
warranty; not even for MERCHANTABILITY or FITNESS FOR A PARTICULAR PURPOSE.

configure:2022: $? = 0
configure:2024: gcc -v </dev/null >&5
Using built-in specs.
Target: i486-linux-gnu
Configured with: ../src/configure -v --enable-languages=c,c++,java,f95,objc,ada,treelang --prefix=/usr --with-gxx-include-dir=/usr/include/c++/4.0.2 --enable-shared --with-system-zlib --libexecdir=/usr/lib --enable-nls --without-included-gettext --enable-threads=posix --program-suffix=-4.0 --enable-__cxa_atexit --enable-libstdcxx-allocator=mt --enable-clocale=gnu --enable-libstdcxx-debug --enable-java-gc=boehm --enable-java-awt=gtk --enable-gtk-cairo --with-java-home=/usr/lib/jvm/java-1.4.2-gcj-4.0-1.4.2.0/jre --enable-mpfr --disable-werror --enable-checking=release i486-linux-gnu
Thread model: posix
gcc version 4.0.2 20050808 (prerelease) (Ubuntu 4.0.1-4ubuntu9)
configure:2027: $? = 0
configure:2029: gcc -V </dev/null >&5
gcc: '-V' option must have argument
configure:2032: $? = 1
configure:2056: checking for C compiler default output
configure:2059: gcc    conftest.c  >&5
configure:2062: $? = 0
configure:2108: result: a.out
configure:2113: checking whether the C compiler works
configure:2119: ./a.out
configure:2122: $? = 0
configure:2139: result: yes
configure:2146: checking whether we are cross compiling
configure:2148: result: no
configure:2151: checking for suffix of executables
configure:2153: gcc -o conftest    conftest.c  >&5
configure:2156: $? = 0
configure:2181: result: 
configure:2187: checking for suffix of object files
configure:2209: gcc -c   conftest.c >&5
configure:2212: $? = 0
configure:2234: result: o
configure:2238: checking whether we are using the GNU C compiler
configure:2263: gcc -c   conftest.c >&5
configure:2266: $? = 0
configure:2269: test -s conftest.o
configure:2272: $? = 0
configure:2285: result: yes
configure:2291: checking whether gcc accepts -g
configure:2313: gcc -c -g  conftest.c >&5
configure:2316: $? = 0
configure:2319: test -s conftest.o
configure:2322: $? = 0
configure:2333: result: yes
configure:2350: checking for gcc option to accept ANSI C
configure:2411: gcc  -c -g -O2  conftest.c >&5
configure:2414: $? = 0
configure:2417: test -s conftest.o
configure:2420: $? = 0
configure:2438: result: none needed
configure:2456: gcc -c -g -O2  conftest.c >&5
conftest.c:2: error: syntax error before 'me'
configure:2459: $? = 1
configure: failed program was:
| #ifndef __cplusplus
|   choke me
| #endif
configure:2570: checking dependency style of gcc
configure:2653: result: gcc3
configure:2672: checking for strerror in -lcposix
configure:2703: gcc -o conftest -g -O2   conftest.c -lcposix   >&5
/usr/bin/ld: cannot find -lcposix
collect2: ld returned 1 exit status
configure:2706: $? = 1
configure: failed program was:
| #line 2679 "configure"
| /* confdefs.h.  */
| 
| #define PACKAGE_NAME ""
| #define PACKAGE_TARNAME ""
| #define PACKAGE_VERSION ""
| #define PACKAGE_STRING ""
| #define PACKAGE_BUGREPORT ""
| #define PACKAGE "z42tool"
| #define VERSION "0.4.3"
| /* end confdefs.h.  */
| 
| /* Override any gcc2 internal prototype to avoid an error.  */
| #ifdef __cplusplus
| extern "C"
| #endif
| /* We use char because int might match the return type of a gcc2
|    builtin and then its argument prototype would still apply.  */
| char strerror ();
| int
| main ()
| {
| strerror ();
|   ;
|   return 0;
| }
configure:2724: result: no
configure:2778: checking for gcc
configure:2804: result: gcc
configure:3048: checking for C compiler version
configure:3051: gcc --version </dev/null >&5
gcc (GCC) 4.0.2 20050808 (prerelease) (Ubuntu 4.0.1-4ubuntu9)
Copyright (C) 2005 Free Software Foundation, Inc.
This is free software; see the source for copying conditions.  There is NO
warranty; not even for MERCHANTABILITY or FITNESS FOR A PARTICULAR PURPOSE.

configure:3054: $? = 0
configure:3056: gcc -v </dev/null >&5
Using built-in specs.
Target: i486-linux-gnu
Configured with: ../src/configure -v --enable-languages=c,c++,java,f95,objc,ada,treelang --prefix=/usr --with-gxx-include-dir=/usr/include/c++/4.0.2 --enable-shared --with-system-zlib --libexecdir=/usr/lib --enable-nls --without-included-gettext --enable-threads=posix --program-suffix=-4.0 --enable-__cxa_atexit --enable-libstdcxx-allocator=mt --enable-clocale=gnu --enable-libstdcxx-debug --enable-java-gc=boehm --enable-java-awt=gtk --enable-gtk-cairo --with-java-home=/usr/lib/jvm/java-1.4.2-gcj-4.0-1.4.2.0/jre --enable-mpfr --disable-werror --enable-checking=release i486-linux-gnu
Thread model: posix
gcc version 4.0.2 20050808 (prerelease) (Ubuntu 4.0.1-4ubuntu9)
configure:3059: $? = 0
configure:3061: gcc -V </dev/null >&5
gcc: '-V' option must have argument
configure:3064: $? = 1
configure:3067: checking whether we are using the GNU C compiler
configure:3114: result: yes
configure:3120: checking whether gcc accepts -g
configure:3162: result: yes
configure:3179: checking for gcc option to accept ANSI C
configure:3267: result: none needed
configure:3285: gcc -c -g -O2  conftest.c >&5
conftest.c:2: error: syntax error before 'me'
configure:3288: $? = 1
configure: failed program was:
| #ifndef __cplusplus
|   choke me
| #endif
configure:3399: checking dependency style of gcc
configure:3482: result: gcc3
configure:3502: checking for gcc option to accept ANSI C
configure:3566: gcc  -c -g -O2  conftest.c >&5
configure:3569: $? = 0
configure:3572: test -s conftest.o
configure:3575: $? = 0
configure:3590: result: none needed
configure:3606: checking how to run the C preprocessor
configure:3642: gcc -E  conftest.c
configure:3648: $? = 0
configure:3680: gcc -E  conftest.c
configure:3681:28: error: ac_nonexistent.h: No such file or directory
configure:3686: $? = 1
configure: failed program was:
| #line 3671 "configure"
| /* confdefs.h.  */
| 
| #define PACKAGE_NAME ""
| #define PACKAGE_TARNAME ""
| #define PACKAGE_VERSION ""
| #define PACKAGE_STRING ""
| #define PACKAGE_BUGREPORT ""
| #define PACKAGE "z42tool"
| #define VERSION "0.4.3"
| /* end confdefs.h.  */
| #include <ac_nonexistent.h>
configure:3724: result: gcc -E
configure:3749: gcc -E  conftest.c
configure:3755: $? = 0
configure:3787: gcc -E  conftest.c
configure:3788:28: error: ac_nonexistent.h: No such file or directory
configure:3793: $? = 1
configure: failed program was:
| #line 3778 "configure"
| /* confdefs.h.  */
| 
| #define PACKAGE_NAME ""
| #define PACKAGE_TARNAME ""
| #define PACKAGE_VERSION ""
| #define PACKAGE_STRING ""
| #define PACKAGE_BUGREPORT ""
| #define PACKAGE "z42tool"
| #define VERSION "0.4.3"
| /* end confdefs.h.  */
| #include <ac_nonexistent.h>
configure:3836: checking for egrep
configure:3846: result: grep -E
configure:3851: checking for ANSI C header files
configure:3877: gcc -c -g -O2  conftest.c >&5
configure:3880: $? = 0
configure:3883: test -s conftest.o
configure:3886: $? = 0
configure:3978: gcc -o conftest -g -O2   conftest.c  >&5
configure: In function 'main':
configure:3973: warning: incompatible implicit declaration of built-in function 'exit'
configure:3981: $? = 0
configure:3983: ./conftest
configure:3986: $? = 0
configure:4001: result: yes
configure:4012: checking whether to enable maintainer-specific portions of Makefiles
configure:4021: result: no
configure:4059: checking for pkg-config
configure:4077: found /usr/bin/pkg-config
configure:4090: result: /usr/bin/pkg-config
configure:4111: checking for GTK+ - version >= 2.0.0
configure:4227: gcc -o conftest -g -O2 -DXTHREADS -DXUSE_MTSAFE_API -I/usr/local/include/cairo -I/usr/local/include -I/usr/local/include/glib-2.0 -I/usr/local/lib/glib-2.0/include -I/usr/include/gtk-2.0 -I/usr/lib/gtk-2.0/include -I/usr/include/atk-1.0 -I/usr/include/pango-1.0 -I/usr/include/cairo     conftest.c -L/usr/local/lib -L/usr/X11R6/lib -lgtk-x11-2.0 -lgdk-x11-2.0 -latk-1.0 -lgdk_pixbuf-2.0 -lm -lpangocairo-1.0 -lfontconfig -lXinerama -lXi -lXrandr -lXext -lXcursor -lXfixes -lpango-1.0 -lcairo -lXrender -lX11 -lgobject-2.0 -lgmodule-2.0 -ldl -lglib-2.0    >&5
/usr/local/lib/libcairo.so: undefined reference to `FT_GlyphSlot_Embolden'
collect2: ld returned 1 exit status
configure:4230: $? = 1
configure: program exited with status 1
configure: failed program was:
| #line 4146 "configure"
| /* confdefs.h.  */
| 
| #define PACKAGE_NAME ""
| #define PACKAGE_TARNAME ""
| #define PACKAGE_VERSION ""
| #define PACKAGE_STRING ""
| #define PACKAGE_BUGREPORT ""
| #define PACKAGE "z42tool"
| #define VERSION "0.4.3"
| #define STDC_HEADERS 1
| /* end confdefs.h.  */
| 
| #include <gtk/gtk.h>
| #include <stdio.h>
| #include <stdlib.h>
| 
| int
| main ()
| {
|   int major, minor, micro;
|   char *tmp_version;
| 
|   system ("touch conf.gtktest");
| 
|   /* HP/UX 9 (%@#!) writes to sscanf strings */
|   tmp_version = g_strdup("2.0.0");
|   if (sscanf(tmp_version, "%d.%d.%d", &major, &minor, &micro) != 3) {
|      printf("%s, bad version string\n", "2.0.0");
|      exit(1);
|    }
| 
|   if ((gtk_major_version != 2) ||
|       (gtk_minor_version != 8) ||
|       (gtk_micro_version != 6))
|     {
|       printf("\n*** 'pkg-config --modversion gtk+-2.0' returned %d.%d.%d, but GTK+ (%d.%d.%d)\n",
|              2, 8, 6,
|              gtk_major_version, gtk_minor_version, gtk_micro_version);
|       printf ("*** was found! If pkg-config was correct, then it is best\n");
|       printf ("*** to remove the old version of GTK+. You may also be able to fix the error\n");
|       printf("*** by modifying your LD_LIBRARY_PATH enviroment variable, or by editing\n");
|       printf("*** /etc/ld.so.conf. Make sure you have run ldconfig if that is\n");
|       printf("*** required on your system.\n");
|       printf("*** If pkg-config was wrong, set the environment variable PKG_CONFIG_PATH\n");
|       printf("*** to point to the correct configuration files\n");
|     }
|   else if ((gtk_major_version != GTK_MAJOR_VERSION) ||
| 	   (gtk_minor_version != GTK_MINOR_VERSION) ||
|            (gtk_micro_version != GTK_MICRO_VERSION))
|     {
|       printf("*** GTK+ header files (version %d.%d.%d) do not match\n",
| 	     GTK_MAJOR_VERSION, GTK_MINOR_VERSION, GTK_MICRO_VERSION);
|       printf("*** library (version %d.%d.%d)\n",
| 	     gtk_major_version, gtk_minor_version, gtk_micro_version);
|     }
|   else
|     {
|       if ((gtk_major_version > major) ||
|         ((gtk_major_version == major) && (gtk_minor_version > minor)) ||
|         ((gtk_major_version == major) && (gtk_minor_version == minor) && (gtk_micro_version >= micro)))
|       {
|         return 0;
|        }
|      else
|       {
|         printf("\n*** An old version of GTK+ (%d.%d.%d) was found.\n",
|                gtk_major_version, gtk_minor_version, gtk_micro_version);
|         printf("*** You need a version of GTK+ newer than %d.%d.%d. The latest version of\n",
| 	       major, minor, micro);
|         printf("*** GTK+ is always available from ftp://ftp.gtk.org.\n");
|         printf("***\n");
|         printf("*** If you have already installed a sufficiently new version, this error\n");
|         printf("*** probably means that the wrong copy of the pkg-config shell script is\n");
|         printf("*** being found. The easiest way to fix this is to remove the old version\n");
|         printf("*** of GTK+, but you can also set the PKG_CONFIG environment to point to the\n");
|         printf("*** correct copy of pkg-config. (In this case, you will have to\n");
|         printf("*** modify your LD_LIBRARY_PATH enviroment variable, or edit /etc/ld.so.conf\n");
|         printf("*** so that the correct libraries are found at run-time))\n");
|       }
|     }
|   return 1;
| }
| 
configure:4257: result: no
configure:4291: gcc -o conftest -g -O2 -DXTHREADS -DXUSE_MTSAFE_API -I/usr/local/include/cairo -I/usr/local/include -I/usr/local/include/glib-2.0 -I/usr/local/lib/glib-2.0/include -I/usr/include/gtk-2.0 -I/usr/lib/gtk-2.0/include -I/usr/include/atk-1.0 -I/usr/include/pango-1.0 -I/usr/include/cairo     conftest.c  -L/usr/local/lib -L/usr/X11R6/lib -lgtk-x11-2.0 -lgdk-x11-2.0 -latk-1.0 -lgdk_pixbuf-2.0 -lm -lpangocairo-1.0 -lfontconfig -lXinerama -lXi -lXrandr -lXext -lXcursor -lXfixes -lpango-1.0 -lcairo -lXrender -lX11 -lgobject-2.0 -lgmodule-2.0 -ldl -lglib-2.0   >&5
/usr/local/lib/libcairo.so: undefined reference to `FT_GlyphSlot_Embolden'
collect2: ld returned 1 exit status
configure:4294: $? = 1
configure: failed program was:
| #line 4271 "configure"
| /* confdefs.h.  */
| 
| #define PACKAGE_NAME ""
| #define PACKAGE_TARNAME ""
| #define PACKAGE_VERSION ""
| #define PACKAGE_STRING ""
| #define PACKAGE_BUGREPORT ""
| #define PACKAGE "z42tool"
| #define VERSION "0.4.3"
| #define STDC_HEADERS 1
| /* end confdefs.h.  */
| 
| #include <gtk/gtk.h>
| #include <stdio.h>
| 
| int
| main ()
| {
|  return ((gtk_major_version) || (gtk_minor_version) || (gtk_micro_version));
|   ;
|   return 0;
| }
configure:4325: error: Cannot find GTK: Is gtk-config in path?

## ---------------- ##
## Cache variables. ##
## ---------------- ##

ac_cv_c_compiler_gnu=yes
ac_cv_env_CC_set=
ac_cv_env_CC_value=
ac_cv_env_CFLAGS_set=
ac_cv_env_CFLAGS_value=
ac_cv_env_CPPFLAGS_set=
ac_cv_env_CPPFLAGS_value=
ac_cv_env_CPP_set=
ac_cv_env_CPP_value=
ac_cv_env_LDFLAGS_set=
ac_cv_env_LDFLAGS_value=
ac_cv_env_build_alias_set=
ac_cv_env_build_alias_value=
ac_cv_env_host_alias_set=
ac_cv_env_host_alias_value=
ac_cv_env_target_alias_set=
ac_cv_env_target_alias_value=
ac_cv_exeext=
ac_cv_header_stdc=yes
ac_cv_lib_cposix_strerror=no
ac_cv_objext=o
ac_cv_path_PKG_CONFIG=/usr/bin/pkg-config
ac_cv_path_install='/usr/bin/install -c'
ac_cv_prog_AWK=gawk
ac_cv_prog_CPP='gcc -E'
ac_cv_prog_ac_ct_CC=gcc
ac_cv_prog_cc_g=yes
ac_cv_prog_cc_stdc=
ac_cv_prog_egrep='grep -E'
ac_cv_prog_make_make_set=yes
am_cv_CC_dependencies_compiler_type=gcc3
am_cv_prog_cc_stdc=

## ----------------- ##
## Output variables. ##
## ----------------- ##

ACLOCAL='${SHELL} /home/intokabile/Desktop/DownloadedFiles/drv_z42/z42tool/missing --run aclocal-1.7'
AMDEPBACKSLASH='\'
AMDEP_FALSE='#'
AMDEP_TRUE=''
AMTAR='${SHELL} /home/intokabile/Desktop/DownloadedFiles/drv_z42/z42tool/missing --run tar'
AUTOCONF='${SHELL} /home/intokabile/Desktop/DownloadedFiles/drv_z42/z42tool/missing --run autoconf'
AUTOHEADER='${SHELL} /home/intokabile/Desktop/DownloadedFiles/drv_z42/z42tool/missing --run autoheader'
AUTOMAKE='${SHELL} /home/intokabile/Desktop/DownloadedFiles/drv_z42/z42tool/missing --run automake-1.7'
AWK='gawk'
CC='gcc'
CCDEPMODE='depmode=gcc3'
CFLAGS='-g -O2'
CPP='gcc -E'
CPPFLAGS=''
CYGPATH_W='echo'
DEFS=''
DEPDIR='.deps'
ECHO_C=''
ECHO_N='-n'
ECHO_T=''
EGREP='grep -E'
EXEEXT=''
GTK_CFLAGS=''
GTK_LIBS=''
INSTALL_DATA='${INSTALL} -m 644'
INSTALL_PROGRAM='${INSTALL}'
INSTALL_SCRIPT='${INSTALL}'
INSTALL_STRIP_PROGRAM='${SHELL} $(install_sh) -c -s'
LDFLAGS=''
LIBOBJS=''
LIBS=''
LTLIBOBJS=''
MAINT='#'
MAINTAINER_MODE_FALSE=''
MAINTAINER_MODE_TRUE='#'
MAKEINFO='${SHELL} /home/intokabile/Desktop/DownloadedFiles/drv_z42/z42tool/missing --run makeinfo'
OBJEXT='o'
PACKAGE='z42tool'
PACKAGE_BUGREPORT=''
PACKAGE_NAME=''
PACKAGE_STRING=''
PACKAGE_TARNAME=''
PACKAGE_VERSION=''
PATH_SEPARATOR=':'
PKG_CONFIG='/usr/bin/pkg-config'
SET_MAKE=''
SHELL='/bin/sh'
STRIP=''
VERSION='0.4.3'
ac_ct_CC='gcc'
ac_ct_STRIP=''
am__fastdepCC_FALSE='#'
am__fastdepCC_TRUE=''
am__include='include'
am__leading_dot='.'
am__quote=''
bindir='${exec_prefix}/bin'
build_alias=''
datadir='${prefix}/share'
exec_prefix='NONE'
host_alias=''
includedir='${prefix}/include'
infodir='${prefix}/info'
install_sh='/home/intokabile/Desktop/DownloadedFiles/drv_z42/z42tool/install-sh'
libdir='${exec_prefix}/lib'
libexecdir='${exec_prefix}/libexec'
localstatedir='${prefix}/var'
mandir='${prefix}/man'
oldincludedir='/usr/include'
prefix='NONE'
program_transform_name='s,x,x,'
sbindir='${exec_prefix}/sbin'
sharedstatedir='${prefix}/com'
sysconfdir='${prefix}/etc'
target_alias=''

## ----------- ##
## confdefs.h. ##
## ----------- ##

#define PACKAGE "z42tool"
#define PACKAGE_BUGREPORT ""
#define PACKAGE_NAME ""
#define PACKAGE_STRING ""
#define PACKAGE_TARNAME ""
#define PACKAGE_VERSION ""
#define STDC_HEADERS 1
#define VERSION "0.4.3"

configure: exit 1

Hors ligne

#19 Le 05/02/2006, à 21:53

lemerou

Re : configure: error: Cannot find GTK: Is gtk-config in path?

essaye de renommer l'autre executable afin que le shell choisisse le bon en faisant par exemple

mv /usr/local/bin/pkg-config /usr/local/bin/pkg-config.bak

RAZIA: LA rAdio ÉtudiAnte de LAVAL (53) : http://www.radiorazia.com

Hors ligne

#20 Le 06/02/2006, à 20:53

intokabile

Re : configure: error: Cannot find GTK: Is gtk-config in path?

Rien de changer

his file contains any messages produced by compilers while
running configure, to aid debugging if configure makes a mistake.

It was created by configure, which was
generated by GNU Autoconf 2.57.  Invocation command line was

  $ ./configure 

## --------- ##
## Platform. ##
## --------- ##

hostname = ubuntu
uname -m = i686
uname -r = 2.6.12-10-386
uname -s = Linux
uname -v = #1 Mon Jan 16 17:18:08 UTC 2006

/usr/bin/uname -p = unknown
/bin/uname -X     = unknown

/bin/arch              = i686
/usr/bin/arch -k       = unknown
/usr/convex/getsysinfo = unknown
hostinfo               = unknown
/bin/machine           = unknown
/usr/bin/oslevel       = unknown
/bin/universe          = unknown

PATH: /usr/local/sbin
PATH: /usr/local/bin
PATH: /usr/sbin
PATH: /usr/bin
PATH: /sbin
PATH: /bin
PATH: /usr/bin/X11


## ----------- ##
## Core tests. ##
## ----------- ##

configure:1273: checking for a BSD-compatible install
configure:1327: result: /usr/bin/install -c
configure:1338: checking whether build environment is sane
configure:1381: result: yes
configure:1414: checking for gawk
configure:1430: found /usr/bin/gawk
configure:1440: result: gawk
configure:1450: checking whether make sets $(MAKE)
configure:1470: result: yes
configure:1647: checking for style of include used by make
configure:1675: result: GNU
configure:1746: checking for gcc
configure:1762: found /usr/bin/gcc
configure:1772: result: gcc
configure:2016: checking for C compiler version
configure:2019: gcc --version </dev/null >&5
gcc (GCC) 4.0.2 20050808 (prerelease) (Ubuntu 4.0.1-4ubuntu9)
Copyright (C) 2005 Free Software Foundation, Inc.
This is free software; see the source for copying conditions.  There is NO
warranty; not even for MERCHANTABILITY or FITNESS FOR A PARTICULAR PURPOSE.

configure:2022: $? = 0
configure:2024: gcc -v </dev/null >&5
Using built-in specs.
Target: i486-linux-gnu
Configured with: ../src/configure -v --enable-languages=c,c++,java,f95,objc,ada,treelang --prefix=/usr --with-gxx-include-dir=/usr/include/c++/4.0.2 --enable-shared --with-system-zlib --libexecdir=/usr/lib --enable-nls --without-included-gettext --enable-threads=posix --program-suffix=-4.0 --enable-__cxa_atexit --enable-libstdcxx-allocator=mt --enable-clocale=gnu --enable-libstdcxx-debug --enable-java-gc=boehm --enable-java-awt=gtk --enable-gtk-cairo --with-java-home=/usr/lib/jvm/java-1.4.2-gcj-4.0-1.4.2.0/jre --enable-mpfr --disable-werror --enable-checking=release i486-linux-gnu
Thread model: posix
gcc version 4.0.2 20050808 (prerelease) (Ubuntu 4.0.1-4ubuntu9)
configure:2027: $? = 0
configure:2029: gcc -V </dev/null >&5
gcc: '-V' option must have argument
configure:2032: $? = 1
configure:2056: checking for C compiler default output
configure:2059: gcc    conftest.c  >&5
configure:2062: $? = 0
configure:2108: result: a.out
configure:2113: checking whether the C compiler works
configure:2119: ./a.out
configure:2122: $? = 0
configure:2139: result: yes
configure:2146: checking whether we are cross compiling
configure:2148: result: no
configure:2151: checking for suffix of executables
configure:2153: gcc -o conftest    conftest.c  >&5
configure:2156: $? = 0
configure:2181: result: 
configure:2187: checking for suffix of object files
configure:2209: gcc -c   conftest.c >&5
configure:2212: $? = 0
configure:2234: result: o
configure:2238: checking whether we are using the GNU C compiler
configure:2263: gcc -c   conftest.c >&5
configure:2266: $? = 0
configure:2269: test -s conftest.o
configure:2272: $? = 0
configure:2285: result: yes
configure:2291: checking whether gcc accepts -g
configure:2313: gcc -c -g  conftest.c >&5
configure:2316: $? = 0
configure:2319: test -s conftest.o
configure:2322: $? = 0
configure:2333: result: yes
configure:2350: checking for gcc option to accept ANSI C
configure:2411: gcc  -c -g -O2  conftest.c >&5
configure:2414: $? = 0
configure:2417: test -s conftest.o
configure:2420: $? = 0
configure:2438: result: none needed
configure:2456: gcc -c -g -O2  conftest.c >&5
conftest.c:2: error: syntax error before 'me'
configure:2459: $? = 1
configure: failed program was:
| #ifndef __cplusplus
|   choke me
| #endif
configure:2570: checking dependency style of gcc
configure:2653: result: gcc3
configure:2672: checking for strerror in -lcposix
configure:2703: gcc -o conftest -g -O2   conftest.c -lcposix   >&5
/usr/bin/ld: cannot find -lcposix
collect2: ld returned 1 exit status
configure:2706: $? = 1
configure: failed program was:
| #line 2679 "configure"
| /* confdefs.h.  */
| 
| #define PACKAGE_NAME ""
| #define PACKAGE_TARNAME ""
| #define PACKAGE_VERSION ""
| #define PACKAGE_STRING ""
| #define PACKAGE_BUGREPORT ""
| #define PACKAGE "z42tool"
| #define VERSION "0.4.3"
| /* end confdefs.h.  */
| 
| /* Override any gcc2 internal prototype to avoid an error.  */
| #ifdef __cplusplus
| extern "C"
| #endif
| /* We use char because int might match the return type of a gcc2
|    builtin and then its argument prototype would still apply.  */
| char strerror ();
| int
| main ()
| {
| strerror ();
|   ;
|   return 0;
| }
configure:2724: result: no
configure:2778: checking for gcc
configure:2804: result: gcc
configure:3048: checking for C compiler version
configure:3051: gcc --version </dev/null >&5
gcc (GCC) 4.0.2 20050808 (prerelease) (Ubuntu 4.0.1-4ubuntu9)
Copyright (C) 2005 Free Software Foundation, Inc.
This is free software; see the source for copying conditions.  There is NO
warranty; not even for MERCHANTABILITY or FITNESS FOR A PARTICULAR PURPOSE.

configure:3054: $? = 0
configure:3056: gcc -v </dev/null >&5
Using built-in specs.
Target: i486-linux-gnu
Configured with: ../src/configure -v --enable-languages=c,c++,java,f95,objc,ada,treelang --prefix=/usr --with-gxx-include-dir=/usr/include/c++/4.0.2 --enable-shared --with-system-zlib --libexecdir=/usr/lib --enable-nls --without-included-gettext --enable-threads=posix --program-suffix=-4.0 --enable-__cxa_atexit --enable-libstdcxx-allocator=mt --enable-clocale=gnu --enable-libstdcxx-debug --enable-java-gc=boehm --enable-java-awt=gtk --enable-gtk-cairo --with-java-home=/usr/lib/jvm/java-1.4.2-gcj-4.0-1.4.2.0/jre --enable-mpfr --disable-werror --enable-checking=release i486-linux-gnu
Thread model: posix
gcc version 4.0.2 20050808 (prerelease) (Ubuntu 4.0.1-4ubuntu9)
configure:3059: $? = 0
configure:3061: gcc -V </dev/null >&5
gcc: '-V' option must have argument
configure:3064: $? = 1
configure:3067: checking whether we are using the GNU C compiler
configure:3114: result: yes
configure:3120: checking whether gcc accepts -g
configure:3162: result: yes
configure:3179: checking for gcc option to accept ANSI C
configure:3267: result: none needed
configure:3285: gcc -c -g -O2  conftest.c >&5
conftest.c:2: error: syntax error before 'me'
configure:3288: $? = 1
configure: failed program was:
| #ifndef __cplusplus
|   choke me
| #endif
configure:3399: checking dependency style of gcc
configure:3482: result: gcc3
configure:3502: checking for gcc option to accept ANSI C
configure:3566: gcc  -c -g -O2  conftest.c >&5
configure:3569: $? = 0
configure:3572: test -s conftest.o
configure:3575: $? = 0
configure:3590: result: none needed
configure:3606: checking how to run the C preprocessor
configure:3642: gcc -E  conftest.c
configure:3648: $? = 0
configure:3680: gcc -E  conftest.c
configure:3681:28: error: ac_nonexistent.h: No such file or directory
configure:3686: $? = 1
configure: failed program was:
| #line 3671 "configure"
| /* confdefs.h.  */
| 
| #define PACKAGE_NAME ""
| #define PACKAGE_TARNAME ""
| #define PACKAGE_VERSION ""
| #define PACKAGE_STRING ""
| #define PACKAGE_BUGREPORT ""
| #define PACKAGE "z42tool"
| #define VERSION "0.4.3"
| /* end confdefs.h.  */
| #include <ac_nonexistent.h>
configure:3724: result: gcc -E
configure:3749: gcc -E  conftest.c
configure:3755: $? = 0
configure:3787: gcc -E  conftest.c
configure:3788:28: error: ac_nonexistent.h: No such file or directory
configure:3793: $? = 1
configure: failed program was:
| #line 3778 "configure"
| /* confdefs.h.  */
| 
| #define PACKAGE_NAME ""
| #define PACKAGE_TARNAME ""
| #define PACKAGE_VERSION ""
| #define PACKAGE_STRING ""
| #define PACKAGE_BUGREPORT ""
| #define PACKAGE "z42tool"
| #define VERSION "0.4.3"
| /* end confdefs.h.  */
| #include <ac_nonexistent.h>
configure:3836: checking for egrep
configure:3846: result: grep -E
configure:3851: checking for ANSI C header files
configure:3877: gcc -c -g -O2  conftest.c >&5
configure:3880: $? = 0
configure:3883: test -s conftest.o
configure:3886: $? = 0
configure:3978: gcc -o conftest -g -O2   conftest.c  >&5
configure: In function 'main':
configure:3973: warning: incompatible implicit declaration of built-in function 'exit'
configure:3981: $? = 0
configure:3983: ./conftest
configure:3986: $? = 0
configure:4001: result: yes
configure:4012: checking whether to enable maintainer-specific portions of Makefiles
configure:4021: result: no
configure:4059: checking for pkg-config
configure:4090: result: no
configure:4111: checking for GTK+ - version >= 2.0.0
configure:4257: result: no
configure:4325: error: Cannot find GTK: Is gtk-config in path?

## ---------------- ##
## Cache variables. ##
## ---------------- ##

ac_cv_c_compiler_gnu=yes
ac_cv_env_CC_set=
ac_cv_env_CC_value=
ac_cv_env_CFLAGS_set=
ac_cv_env_CFLAGS_value=
ac_cv_env_CPPFLAGS_set=
ac_cv_env_CPPFLAGS_value=
ac_cv_env_CPP_set=
ac_cv_env_CPP_value=
ac_cv_env_LDFLAGS_set=
ac_cv_env_LDFLAGS_value=
ac_cv_env_build_alias_set=
ac_cv_env_build_alias_value=
ac_cv_env_host_alias_set=
ac_cv_env_host_alias_value=
ac_cv_env_target_alias_set=
ac_cv_env_target_alias_value=
ac_cv_exeext=
ac_cv_header_stdc=yes
ac_cv_lib_cposix_strerror=no
ac_cv_objext=o
ac_cv_path_PKG_CONFIG=no
ac_cv_path_install='/usr/bin/install -c'
ac_cv_prog_AWK=gawk
ac_cv_prog_CPP='gcc -E'
ac_cv_prog_ac_ct_CC=gcc
ac_cv_prog_cc_g=yes
ac_cv_prog_cc_stdc=
ac_cv_prog_egrep='grep -E'
ac_cv_prog_make_make_set=yes
am_cv_CC_dependencies_compiler_type=gcc3
am_cv_prog_cc_stdc=

## ----------------- ##
## Output variables. ##
## ----------------- ##

ACLOCAL='${SHELL} /home/intokabile/Desktop/DownloadedFiles/drv_z42/z42tool/missing --run aclocal-1.7'
AMDEPBACKSLASH='\'
AMDEP_FALSE='#'
AMDEP_TRUE=''
AMTAR='${SHELL} /home/intokabile/Desktop/DownloadedFiles/drv_z42/z42tool/missing --run tar'
AUTOCONF='${SHELL} /home/intokabile/Desktop/DownloadedFiles/drv_z42/z42tool/missing --run autoconf'
AUTOHEADER='${SHELL} /home/intokabile/Desktop/DownloadedFiles/drv_z42/z42tool/missing --run autoheader'
AUTOMAKE='${SHELL} /home/intokabile/Desktop/DownloadedFiles/drv_z42/z42tool/missing --run automake-1.7'
AWK='gawk'
CC='gcc'
CCDEPMODE='depmode=gcc3'
CFLAGS='-g -O2'
CPP='gcc -E'
CPPFLAGS=''
CYGPATH_W='echo'
DEFS=''
DEPDIR='.deps'
ECHO_C=''
ECHO_N='-n'
ECHO_T=''
EGREP='grep -E'
EXEEXT=''
GTK_CFLAGS=''
GTK_LIBS=''
INSTALL_DATA='${INSTALL} -m 644'
INSTALL_PROGRAM='${INSTALL}'
INSTALL_SCRIPT='${INSTALL}'
INSTALL_STRIP_PROGRAM='${SHELL} $(install_sh) -c -s'
LDFLAGS=''
LIBOBJS=''
LIBS=''
LTLIBOBJS=''
MAINT='#'
MAINTAINER_MODE_FALSE=''
MAINTAINER_MODE_TRUE='#'
MAKEINFO='${SHELL} /home/intokabile/Desktop/DownloadedFiles/drv_z42/z42tool/missing --run makeinfo'
OBJEXT='o'
PACKAGE='z42tool'
PACKAGE_BUGREPORT=''
PACKAGE_NAME=''
PACKAGE_STRING=''
PACKAGE_TARNAME=''
PACKAGE_VERSION=''
PATH_SEPARATOR=':'
PKG_CONFIG='no'
SET_MAKE=''
SHELL='/bin/sh'
STRIP=''
VERSION='0.4.3'
ac_ct_CC='gcc'
ac_ct_STRIP=''
am__fastdepCC_FALSE='#'
am__fastdepCC_TRUE=''
am__include='include'
am__leading_dot='.'
am__quote=''
bindir='${exec_prefix}/bin'
build_alias=''
datadir='${prefix}/share'
exec_prefix='NONE'
host_alias=''
includedir='${prefix}/include'
infodir='${prefix}/info'
install_sh='/home/intokabile/Desktop/DownloadedFiles/drv_z42/z42tool/install-sh'
libdir='${exec_prefix}/lib'
libexecdir='${exec_prefix}/libexec'
localstatedir='${prefix}/var'
mandir='${prefix}/man'
oldincludedir='/usr/include'
prefix='NONE'
program_transform_name='s,x,x,'
sbindir='${exec_prefix}/sbin'
sharedstatedir='${prefix}/com'
sysconfdir='${prefix}/etc'
target_alias=''

## ----------- ##
## confdefs.h. ##
## ----------- ##

#define PACKAGE "z42tool"
#define PACKAGE_BUGREPORT ""
#define PACKAGE_NAME ""
#define PACKAGE_STRING ""
#define PACKAGE_TARNAME ""
#define PACKAGE_VERSION ""
#define STDC_HEADERS 1
#define VERSION "0.4.3"

configure: exit 1

Hors ligne

#21 Le 06/02/2006, à 21:49

intokabile

Re : configure: error: Cannot find GTK: Is gtk-config in path?

En fait je viens de me rappeller que j'avais installer avant le libgtk2-dev les lib pango,cairo,...Mais je n'avais toujours pas réussi à installer le gtk.Alors je me dis que peut être que ces librairies installés entre en conflit avec celles du libgtk2-dev. Je viens de lire que ces paquets sont installés avec ce dernier.Comment les supprimer?Est ce que ça peut venir de là?

Hors ligne

#22 Le 08/02/2006, à 18:44

intokabile

Re : configure: error: Cannot find GTK: Is gtk-config in path?

J'ai résolu le problème.J'ai réinstaller ubuntu.Et maintenant tout marche bien.Je crois qu'il y avait bien un conflit quelque part.:D

Hors ligne